{"text_format":"1","workbook":"xlsx","n_sheets":4,"sheets":["中国主要城市","手动输入数据","查询比对","中国数据"],"not_rendered":{"charts":4,"images":5,"macros":1,"external_links":0,"defined_names":3,"comments":0,"pivot_tables":0},"unopened":[],"bounds":{"document_bytes":16777216,"sheet_cells":100000,"rows_first":2000,"rows_last":500,"rows_between":2000,"halvings":0,"cell_chars":16384,"cell_head_chars":4096},"cells_cut":0,"cells_raw":0,"read":"whole","date_system":"1900"}

{"sheet":"中国主要城市","index":0,"n_rows":108,"n_cols":6,"rows_kept":108,"cut":false,"hidden":false,"merged":[[32,3,107,3],[26,2,26,14],[30,3,30,17],[8,1,8,3],[9,1,9,3],[1,1,1,9],[2,1,2,3],[2,5,2,9],[3,2,3,3],[11,16,11,18],[4,16,4,18],[5,17,5,18],[6,17,6,18],[7,17,7,18],[8,17,8,18],[9,16,9,18],[10,16,10,18],[4,2,4,3],[5,2,5,3],[6,2,6,3],[7,1,7,3]]}
["nanchang"]
[{"$f":"VLOOKUP(A1,A34:B151,2,FALSE)","v":"南昌"},"中国主要城市气候统计表与气候统计图查询"]
[null,"城市气候统计表",null,null,null,{"$f":"C5","v":"南昌"}]
[null,"选择国家","中国"]
[null,"选择城市","南昌"]
[null,"资料来源",{"$f":"INDEX(INDIRECT($C$4&\"数据!b5:b1111\"),MATCH($C$5,INDIRECT($C$4&\"数据!a5:a1111\"),0))","v":"真实数据"}]
[null,"位置",{"$f":"INDEX(INDIRECT($C$4&\"数据!c5:c1111\"),MATCH($C$5,INDIRECT($C$4&\"数据!a5:a1111\"),0))","v":"28.6ºN，115.9ºE，海拔47m"}]
[]
[null,{"$f":"$C$5","v":"南昌"}]
[null,{"$f":"\"（\"&$B$7&\"：\"&$C$7&\"）\"","v":"（位置：28.6ºN，115.9ºE，海拔47m）"}]
[null,"月份","气温（℃）","降水（mm）"]
[null,1,{"$f":"INDEX(INDIRECT($C$4&\"数据!d5:d1111\"),MATCH($C$5,INDIRECT($C$4&\"数据!a5:a111\"),0))","v":5.0999999999999996},{"$f":"INDEX(INDIRECT($C$4&\"数据!p5:p1111\"),MATCH($C$5,INDIRECT($C$4&\"数据!a5:a1111\"),0))","v":56.1}]
[null,null,{"$f":"INDEX(INDIRECT($C$4&\"数据!e5:e1111\"),MATCH($C$5,INDIRECT($C$4&\"数据!a5:a111\"),0))","v":6.3},{"$f":"INDEX(INDIRECT($C$4&\"数据!q5:q1111\"),MATCH($C$5,INDIRECT($C$4&\"数据!a5:a1111\"),0))","v":101.5}]
[null,null,{"$f":"INDEX(INDIRECT($C$4&\"数据!f5:f1111\"),MATCH($C$5,INDIRECT($C$4&\"数据!a5:a111\"),0))","v":10.9},{"$f":"INDEX(INDIRECT($C$4&\"数据!r5:r1111\"),MATCH($C$5,INDIRECT($C$4&\"数据!a5:a1111\"),0))","v":150.9}]
[null,4,{"$f":"INDEX(INDIRECT($C$4&\"数据!g5:g1111\"),MATCH($C$5,INDIRECT($C$4&\"数据!a5:a111\"),0))","v":17},{"$f":"INDEX(INDIRECT($C$4&\"数据!s5:s1111\"),MATCH($C$5,INDIRECT($C$4&\"数据!a5:a1111\"),0))","v":224.3}]
[null,null,{"$f":"INDEX(INDIRECT($C$4&\"数据!h5:h1111\"),MATCH($C$5,INDIRECT($C$4&\"数据!a5:a111\"),0))","v":22.2},{"$f":"INDEX(INDIRECT($C$4&\"数据!t5:t1111\"),MATCH($C$5,INDIRECT($C$4&\"数据!a5:a1111\"),0))","v":253}]
[null,null,{"$f":"INDEX(INDIRECT($C$4&\"数据!i5:i1111\"),MATCH($C$5,INDIRECT($C$4&\"数据!a5:a111\"),0))","v":25.6},{"$f":"INDEX(INDIRECT($C$4&\"数据!u5:u1111\"),MATCH($C$5,INDIRECT($C$4&\"数据!a5:a1111\"),0))","v":282}]
[null,7,{"$f":"INDEX(INDIRECT($C$4&\"数据!j5:j1111\"),MATCH($C$5,INDIRECT($C$4&\"数据!a5:a111\"),0))","v":29.5},{"$f":"INDEX(INDIRECT($C$4&\"数据!v5:v1111\"),MATCH($C$5,INDIRECT($C$4&\"数据!a5:a1111\"),0))","v":122.4}]
[null,null,{"$f":"INDEX(INDIRECT($C$4&\"数据!k5:k1111\"),MATCH($C$5,INDIRECT($C$4&\"数据!a5:a111\"),0))","v":29.2},{"$f":"INDEX(INDIRECT($C$4&\"数据!w5:w1111\"),MATCH($C$5,INDIRECT($C$4&\"数据!a5:a1111\"),0))","v":103.3}]
[null,null,{"$f":"INDEX(INDIRECT($C$4&\"数据!l5:l1111\"),MATCH($C$5,INDIRECT($C$4&\"数据!a5:a111\"),0))","v":24.7},{"$f":"INDEX(INDIRECT($C$4&\"数据!x5:x1111\"),MATCH($C$5,INDIRECT($C$4&\"数据!a5:a1111\"),0))","v":75.2}]
[null,10,{"$f":"INDEX(INDIRECT($C$4&\"数据!m5:m1111\"),MATCH($C$5,INDIRECT($C$4&\"数据!a5:a111\"),0))","v":19.3},{"$f":"INDEX(INDIRECT($C$4&\"数据!y5:y1111\"),MATCH($C$5,INDIRECT($C$4&\"数据!a5:a1111\"),0))","v":57.5}]
[null,null,{"$f":"INDEX(INDIRECT($C$4&\"数据!n5:n1111\"),MATCH($C$5,INDIRECT($C$4&\"数据!a5:a111\"),0))","v":13.2},{"$f":"INDEX(INDIRECT($C$4&\"数据!z5:z1111\"),MATCH($C$5,INDIRECT($C$4&\"数据!a5:a1111\"),0))","v":54.5}]
[null,null,{"$f":"INDEX(INDIRECT($C$4&\"数据!o5:o1111\"),MATCH($C$5,INDIRECT($C$4&\"数据!a5:a111\"),0))","v":7.5},{"$f":"INDEX(INDIRECT($C$4&\"数据!aa5:aa1111\"),MATCH($C$5,INDIRECT($C$4&\"数据!a5:a1111\"),0))","v":40.5}]
[null,null,null,{"$f":"SUM(D12:D23)","v":1521.2}]
[]
[]
[null,null,"使用说明：1、请单击工作表选择相应的功能模块。"]
[null,null,"          2、文件打开时请允许启用宏，否则，无法点击城市自动生成气温降水图。"]
[null,null,"          3、可点击城市后面的单元格，选择相应的城市（茶色（■） 的单元格），点击地图上的蓝色点同时也能生成相应城市气候图表；"]
[null,null,"          4、所有数据均来源于香港天文台，更多数据自行查找，网址如下："]
{"$rows_left_out":79}
{"sheet":"手动输入数据","index":1,"n_rows":19,"n_cols":27,"rows_kept":19,"cut":false,"hidden":false,"merged":[[18,1,20,3],[1,1,1,3],[2,1,2,3],[3,17,3,18],[4,17,4,18],[5,17,5,18],[2,16,2,18]]}
["qilianshan"]
[null,"丹东"]
[]
[null,"月份","气温（℃）","降水（mm）"]
[null,1,-7.8,10.3]
[null,null,-3.9,11]
[null,null,2.4,22]
[null,4,9.1999999999999993,43.5]
[null,null,15.1,74.099999999999994,null,null,null,null,null,null,null,null,null,"丹东","Jan","Feb","Mar","Apr","May","Jun","Jul","Aug","Sep","Oct","Nov","Dec","Year"]
[null,null,19.8,94.4,null,null,null,null,null,null,null,null,null,"°C",-7.8,-3.9,2.4,9.1999999999999993,15.1,19.8,23.1,23.8,18.5,11.8,2.6,-4.0999999999999996,9.3000000000000007]
[null,7,23.1,290.39999999999998,null,null,null,null,null,null,null,null,null,"mm",10.3,11,22,43.5,74.099999999999994,94.4,290.39999999999998,250.7,115.5,59.5,34.799999999999997,12,1017.7]
[null,null,23.8,250.7]
[null,null,18.5,115.5]
[null,10,11.8,59.5]
[null,null,2.6,34.799999999999997]
[null,null,-4.0999999999999996,12]
[null,null,null,{"$f":"SUM(D5:D16)","v":1018.1999999999998}]
[]
[null,"说明：在上面绿色区域内输入数据即可自动生成图表，根据需要调整字号大小和文字位置，复制即可使用。"]

{"sheet":"查询比对","index":2,"n_rows":28,"n_cols":33,"rows_kept":28,"cut":false,"hidden":false,"merged":[[2,1,2,3],[2,5,2,9],[4,2,4,3],[0,1,0,19],[9,1,9,3],[8,1,8,3],[7,17,7,19],[8,17,8,19],[9,17,9,19],[7,1,7,3],[6,2,6,3],[2,17,2,19],[2,11,2,15],[3,18,3,19],[4,18,4,19],[5,18,5,19],[6,18,6,19],[5,2,5,3],[3,2,3,3]]}
[null,"中国主要城市气候统计表与气候统计图查询比较"]
[null,null,null,null,null,null,null,null,null,null,null,null,null,null,null,null,null,null,null,null,null,null,null,null,null,null,null,null,null,null,null,null,"区域"]
[null,"城市气候统计表",null,null,null,{"$f":"C5","v":"齐齐哈尔"},null,null,null,null,null,{"$f":"S5","v":"海口"},null,null,null,null,null,"城市气候统计表",null,null,null,null,null,null,null,null,null,null,null,null,null,null,"中国"]
[null,"选择国家","中国",null,null,null,null,null,null,null,null,null,null,null,null,null,null,"选择国家","中国"]
[null,"选择城市","齐齐哈尔",null,null,null,null,null,null,null,null,null,null,null,null,null,null,"选择城市","海口"]
[null,"数据来源",{"$f":"INDEX(INDIRECT($C$4&\"数据!b5:b1111\"),MATCH($C$5,INDIRECT($C$4&\"数据!a5:a1111\"),0))","v":"真实数据"},null,null,null,null,null,null,null,null,null,null,null,null,null,null,"数据来源",{"$f":"INDEX(INDIRECT($S$4&\"数据!b5:b1111\"),MATCH($S$5,INDIRECT($S$4&\"数据!a5:a1111\"),0))","v":"真实数据"}]
[null,"位    置",{"$f":"INDEX(INDIRECT($C$4&\"数据!c5:c1111\"),MATCH($C$5,INDIRECT($C$4&\"数据!a5:a1111\"),0))","v":"47.4ºN，123.9ºE，海拔146m"},null,null,null,null,null,null,null,null,null,null,null,null,null,null,"位    置",{"$f":"INDEX(INDIRECT($S$4&\"数据!c5:c1111\"),MATCH($S$5,INDIRECT($S$4&\"数据!a5:a1111\"),0))","v":"20.0ºN，110.4ºE，海拔14m"}]
[]
[null,{"$f":"$C$5","v":"齐齐哈尔"},null,null,null,null,null,null,null,null,null,null,null,null,null,null,null,{"$f":"$S$5","v":"海口"}]
[null,{"$f":"\"（\"&\"位置：\"&$C$7&\"）\"","v":"（位置：47.4ºN，123.9ºE，海拔146m）"},null,null,null,null,null,null,null,null,null,null,null,null,null,null,null,{"$f":"\"（\"&\"位置：\"&$S$7&\"）\"","v":"（位置：20.0ºN，110.4ºE，海拔14m）"}]
[null,"月份","气温（℃）","降水（mm）",null,null,null,null,null,null,null,null,null,null,null,null,null,"月份","气温（℃）","降水（mm）"]
[null,1,{"$f":"INDEX(INDIRECT($C$4&\"数据!d5:d1111\"),MATCH($C$5,INDIRECT($C$4&\"数据!a5:a111\"),0))","v":-19.2},{"$f":"INDEX(INDIRECT($C$4&\"数据!p5:p1111\"),MATCH($C$5,INDIRECT($C$4&\"数据!a5:a1111\"),0))","v":1.3},null,null,null,null,null,null,null,null,null,null,null,null,null,1,{"$f":"INDEX(INDIRECT($S$4&\"数据!d5:d1111\"),MATCH($S$5,INDIRECT($S$4&\"数据!a5:a111\"),0))","v":17.2},{"$f":"INDEX(INDIRECT($S$4&\"数据!p5:p1111\"),MATCH($S$5,INDIRECT($S$4&\"数据!a5:a1111\"),0))","v":21.6}]
[null,null,{"$f":"INDEX(INDIRECT($C$4&\"数据!e5:e1111\"),MATCH($C$5,INDIRECT($C$4&\"数据!a5:a111\"),0))","v":-14.8},{"$f":"INDEX(INDIRECT($C$4&\"数据!q5:q1111\"),MATCH($C$5,INDIRECT($C$4&\"数据!a5:a1111\"),0))","v":1.8},null,null,null,null,null,null,null,null,null,null,null,null,null,null,{"$f":"INDEX(INDIRECT($S$4&\"数据!e5:e1111\"),MATCH($S$5,INDIRECT($S$4&\"数据!a5:a111\"),0))","v":18.2},{"$f":"INDEX(INDIRECT($S$4&\"数据!q5:q1111\"),MATCH($S$5,INDIRECT($S$4&\"数据!a5:a1111\"),0))","v":34.200000000000003}]
[null,null,{"$f":"INDEX(INDIRECT($C$4&\"数据!f5:f1111\"),MATCH($C$5,INDIRECT($C$4&\"数据!a5:a111\"),0))","v":-4.5},{"$f":"INDEX(INDIRECT($C$4&\"数据!r5:r1111\"),MATCH($C$5,INDIRECT($C$4&\"数据!a5:a1111\"),0))","v":4.7},null,null,null,null,null,null,null,null,null,null,null,null,null,null,{"$f":"INDEX(INDIRECT($S$4&\"数据!f5:f1111\"),MATCH($S$5,INDIRECT($S$4&\"数据!a5:a111\"),0))","v":21.3},{"$f":"INDEX(INDIRECT($S$4&\"数据!r5:r1111\"),MATCH($S$5,INDIRECT($S$4&\"数据!a5:a1111\"),0))","v":51.3}]
[null,4,{"$f":"INDEX(INDIRECT($C$4&\"数据!g5:g1111\"),MATCH($C$5,INDIRECT($C$4&\"数据!a5:a111\"),0))","v":6.1},{"$f":"INDEX(INDIRECT($C$4&\"数据!s5:s1111\"),MATCH($C$5,INDIRECT($C$4&\"数据!a5:a1111\"),0))","v":15.1},null,null,null,null,null,null,null,null,null,null,null,null,null,4,{"$f":"INDEX(INDIRECT($S$4&\"数据!g5:g1111\"),MATCH($S$5,INDIRECT($S$4&\"数据!a5:a111\"),0))","v":24.8},{"$f":"INDEX(INDIRECT($S$4&\"数据!s5:s1111\"),MATCH($S$5,INDIRECT($S$4&\"数据!a5:a1111\"),0))","v":105.9}]
[null,null,{"$f":"INDEX(INDIRECT($C$4&\"数据!h5:h1111\"),MATCH($C$5,INDIRECT($C$4&\"数据!a5:a111\"),0))","v":14.4},{"$f":"INDEX(INDIRECT($C$4&\"数据!t5:t1111\"),MATCH($C$5,INDIRECT($C$4&\"数据!a5:a1111\"),0))","v":30.5},null,null,null,null,null,null,null,null,null,null,null,null,null,null,{"$f":"INDEX(INDIRECT($S$4&\"数据!h5:h1111\"),MATCH($S$5,INDIRECT($S$4&\"数据!a5:a111\"),0))","v":27.3},{"$f":"INDEX(INDIRECT($S$4&\"数据!t5:t1111\"),MATCH($S$5,INDIRECT($S$4&\"数据!a5:a1111\"),0))","v":182.8}]
[null,null,{"$f":"INDEX(INDIRECT($C$4&\"数据!i5:i1111\"),MATCH($C$5,INDIRECT($C$4&\"数据!a5:a111\"),0))","v":20.3},{"$f":"INDEX(INDIRECT($C$4&\"数据!u5:u1111\"),MATCH($C$5,INDIRECT($C$4&\"数据!a5:a1111\"),0))","v":64.2},null,null,null,null,null,null,null,null,null,null,null,null,null,null,{"$f":"INDEX(INDIRECT($S$4&\"数据!i5:i1111\"),MATCH($S$5,INDIRECT($S$4&\"数据!a5:a111\"),0))","v":28.1},{"$f":"INDEX(INDIRECT($S$4&\"数据!u5:u1111\"),MATCH($S$5,INDIRECT($S$4&\"数据!a5:a1111\"),0))","v":211.1}]
[null,7,{"$f":"INDEX(INDIRECT($C$4&\"数据!j5:j1111\"),MATCH($C$5,INDIRECT($C$4&\"数据!a5:a111\"),0))","v":22.8},{"$f":"INDEX(INDIRECT($C$4&\"数据!v5:v1111\"),MATCH($C$5,INDIRECT($C$4&\"数据!a5:a1111\"),0))","v":137.5},null,null,null,null,null,null,null,null,null,null,null,null,null,7,{"$f":"INDEX(INDIRECT($S$4&\"数据!j5:j1111\"),MATCH($S$5,INDIRECT($S$4&\"数据!a5:a111\"),0))","v":28.4},{"$f":"INDEX(INDIRECT($S$4&\"数据!v5:v1111\"),MATCH($S$5,INDIRECT($S$4&\"数据!a5:a1111\"),0))","v":210}]
[null,null,{"$f":"INDEX(INDIRECT($C$4&\"数据!k5:k1111\"),MATCH($C$5,INDIRECT($C$4&\"数据!a5:a111\"),0))","v":20.9},{"$f":"INDEX(INDIRECT($C$4&\"数据!w5:w1111\"),MATCH($C$5,INDIRECT($C$4&\"数据!a5:a1111\"),0))","v":94},null,null,null,null,null,null,null,null,null,null,null,null,null,null,{"$f":"INDEX(INDIRECT($S$4&\"数据!k5:k1111\"),MATCH($S$5,INDIRECT($S$4&\"数据!a5:a111\"),0))","v":27.8},{"$f":"INDEX(INDIRECT($S$4&\"数据!w5:w1111\"),MATCH($S$5,INDIRECT($S$4&\"数据!a5:a1111\"),0))","v":224.8}]
[null,null,{"$f":"INDEX(INDIRECT($C$4&\"数据!l5:l1111\"),MATCH($C$5,INDIRECT($C$4&\"数据!a5:a111\"),0))","v":14},{"$f":"INDEX(INDIRECT($C$4&\"数据!x5:x1111\"),MATCH($C$5,INDIRECT($C$4&\"数据!a5:a1111\"),0))","v":44.8},null,null,null,null,null,null,null,null,null,null,null,null,null,null,{"$f":"INDEX(INDIRECT($S$4&\"数据!l5:l1111\"),MATCH($S$5,INDIRECT($S$4&\"数据!a5:a111\"),0))","v":26.9},{"$f":"INDEX(INDIRECT($S$4&\"数据!x5:x1111\"),MATCH($S$5,INDIRECT($S$4&\"数据!a5:a1111\"),0))","v":250.9}]
[null,10,{"$f":"INDEX(INDIRECT($C$4&\"数据!m5:m1111\"),MATCH($C$5,INDIRECT($C$4&\"数据!a5:a111\"),0))","v":4.8},{"$f":"INDEX(INDIRECT($C$4&\"数据!y5:y1111\"),MATCH($C$5,INDIRECT($C$4&\"数据!a5:a1111\"),0))","v":19.2},null,null,null,null,null,null,null,null,null,null,null,null,null,10,{"$f":"INDEX(INDIRECT($S$4&\"数据!m5:m1111\"),MATCH($S$5,INDIRECT($S$4&\"数据!a5:a111\"),0))","v":25},{"$f":"INDEX(INDIRECT($S$4&\"数据!y5:y1111\"),MATCH($S$5,INDIRECT($S$4&\"数据!a5:a1111\"),0))","v":201.1}]
[null,null,{"$f":"INDEX(INDIRECT($C$4&\"数据!n5:n1111\"),MATCH($C$5,INDIRECT($C$4&\"数据!a5:a111\"),0))","v":-7.1},{"$f":"INDEX(INDIRECT($C$4&\"数据!z5:z1111\"),MATCH($C$5,INDIRECT($C$4&\"数据!a5:a1111\"),0))","v":4.2},null,null,null,null,null,null,null,null,null,null,null,null,null,null,{"$f":"INDEX(INDIRECT($S$4&\"数据!n5:n1111\"),MATCH($S$5,INDIRECT($S$4&\"数据!a5:a111\"),0))","v":22},{"$f":"INDEX(INDIRECT($S$4&\"数据!z5:z1111\"),MATCH($S$5,INDIRECT($S$4&\"数据!a5:a1111\"),0))","v":97.2}]
[null,null,{"$f":"INDEX(INDIRECT($C$4&\"数据!o5:o1111\"),MATCH($C$5,INDIRECT($C$4&\"数据!a5:a111\"),0))","v":-16.2},{"$f":"INDEX(INDIRECT($C$4&\"数据!aa5:aa1111\"),MATCH($C$5,INDIRECT($C$4&\"数据!a5:a1111\"),0))","v":2.6},null,null,null,null,null,null,null,null,null,null,null,null,null,null,{"$f":"INDEX(INDIRECT($S$4&\"数据!o5:o1111\"),MATCH($S$5,INDIRECT($S$4&\"数据!a5:a111\"),0))","v":18.7},{"$f":"INDEX(INDIRECT($S$4&\"数据!aa5:aa1111\"),MATCH($S$5,INDIRECT($S$4&\"数据!a5:a1111\"),0))","v":34.1}]
[null,null,null,{"$f":"SUM(D12:D23)","v":419.90000000000003},null,null,null,null,null,null,null,null,null,null,null,null,null,null,null,{"$f":"SUM(T12:T23)","v":1625}]
[]
[]
[]
[null,"在两个城市气候统计表中分别选择想对比的城市，即可自动生成相应的气候图表。"]

{"sheet":"中国数据","index":3,"n_rows":80,"n_cols":51,"rows_kept":80,"cut":false,"hidden":false,"merged":[[2,0,2,2],[2,39,2,50],[2,27,2,38],[2,15,2,26],[2,3,2,14]]}
[{"$f":"$A$3","v":"中国数据部分城市位置及气候统计表"}]
[]
[{"$f":"myname&\"部分城市位置及气候统计表\"","v":"中国数据部分城市位置及气候统计表"},null,null,"月平均气温资料（单位：℃）",null,null,null,null,null,null,null,null,null,null,null,"月降水量资料（单位：mm）",null,null,null,null,null,null,null,null,null,null,null,"平均雨日数",null,null,null,null,null,null,null,null,null,null,null,"平均日照时数"]
["城市名称","气候类型","经纬度位置","1月","2月","3月","4月","5月","6月","7月","8月","9月","10月","11月","12月","1月","2月","3月","4月","5月","6月","7月","8月","9月","10月","11月","12月","1月","2月","3月","4月","5月","6月","7月","8月","9月","10月","11月","12月","1月","2月","3月","4月","5月","6月","7月","8月","9月","10月","11月","12月"]
["乌鲁木齐","暂无数据，用阿勒泰数据","47.7ºN，88.1ºE，海拔735m",-16.100000000000001,-14.7,-5.4,7.5,15.4,20.3,22,20.3,14.4,5.8,-4.8,-13.4,11.5,9.6999999999999993,8.6999999999999993,10.9,18.100000000000001,14.2,22,13.6,15.4,16.600000000000001,19,15.6,2.9,2.7,2.4,2.5,3.6,3.2,4.0999999999999996,2.9,3.1,3.5,4.3,4.2,5.3,6.8,7.9,9.4,10.4,11.2,11.1,10.5,9.3000000000000007,6.9,5,4.4000000000000004]
["康定","暂无数据，用成都数据","30.7ºN，104.0ºE，海拔506m",5.5,7.2,11.6,16.5,21,23.5,25.2,24.9,21,16.899999999999999,11.8,7.1,7.3,10.3,20.5,46.6,87.1,102.8,230.5,223.7,131.5,39.4,16.5,5,2.5,3.5,5.8,7.8,9.6999999999999993,10.4,13.1,12,11.7,7.8,3.9,1.4,2.2000000000000002,2.1,3.1,3.8,4.2,4.3,4.8,5.3,2.7,2.1,2,1.9]
["呼和浩特","暂无数据，用二连浩特数据","43.7ºN，112.0ºE，海拔965m",-18.5,-14.8,-4.5999999999999996,6.1,14.6,20.5,23,20.8,13.5,4.5999999999999996,-6.6,-15.7,1.4,1.1000000000000001,1.9,5,8.3000000000000007,16.600000000000001,36.5,39.6,18.399999999999999,7.9,2,0.8,0.5,0.4,0.6,1.3,1.7,3.3,5.5,5.8,3,1.7,0.6,0.1,7,8.1,9.1999999999999993,9.6999999999999993,10.5,10.8,10.3,9.6,9.4,8.4,7.2,6.6]
["敦煌","暂无数据，用哈密数据","42.8ºN，93.5ºE，海拔737m",-10.5,-4.8,4.5999999999999996,13.2,20.3,24.7,26.6,25.2,18.5,9.6999999999999993,-0.1,-8.3000000000000007,1.3,1.4,1,2,3.2,6.2,6.7,4.9000000000000004,3.3,2.6,1.5,0.9,0.4,0.4,0.4,0.5,0.8,1.3,1.5,1.2,1,0.6,0.4,0.3,6.9,8.1,8.8000000000000007,9.6999999999999993,10.9,11.2,11,10.6,10.1,9,7.4,6.5]
["三亚","暂无数据，用海口数据","20.0ºN，110.4ºE，海拔14m",17.2,18.2,21.3,24.8,27.3,28.1,28.4,27.8,26.9,25,22,18.7,21.6,34.200000000000003,51.3,105.9,182.8,211.1,210,224.8,250.9,201.1,97.2,34.1,4.3,6.2,5.9,7.8,12.3,12.3,10.5,11.6,11.5,9.8000000000000007,6.1,4.2,4.0999999999999996,3.7,4.5999999999999996,5.9,7.5,7.5,8.4,7.3,6.8,6.1,5.2,4.7]
["漠河","暂无数据，用海拉尔数据","49.2ºN，119.8ºE，海拔610m",-26.2,-23,-11.7,1.7,10.6,17.2,19.7,17.2,9.9,0.3,-12.6,-22.6,2.8,2.6,4.2,11.8,22.9,59.8,103.7,89.1,35,10.3,4.3,4.5,0.8,0.7,1.4,2.9,4.3,8.6999999999999993,10.8,9.6,6,2.2999999999999998,1.4,1.1000000000000001,5.7,7.2,8,8.4,9.6,10,9.3000000000000007,8.8000000000000007,7.4,7.1,5.9,4.8]
["祁连山","暂无数据，用酒泉数据","39.8ºN，98.5ºE，海拔1477m",-9.3000000000000007,-6,1.6,9.3000000000000007,15.8,19.7,21.4,20.399999999999999,14.7,7.4,-1,-7.7,1.6,1.7,4,4.5,10.199999999999999,13.7,19.5,17.3,10.4,2.4,1.6,1.1000000000000001,0.6,0.5,1.1000000000000001,1.1000000000000001,1.6,2.7,4.2,3.1,2.4,0.7,0.5,0.3,7.1,7.6,7.8,8.6999999999999993,9.4,9.6999999999999993,9.1,9.1999999999999993,9,8.6,7.5,6.8]
["西宁","暂无数据，用兰州数据","36.1ºN，103.9ºE，海拔1517m",-6.1,-2,5,11.7,16.8,20.100000000000001,22.1,21,15.7,9.6999999999999993,1.9,-4.8,1.1000000000000001,2.4,8.9,19.100000000000001,38.200000000000003,36.799999999999997,57.4,75.900000000000006,46.3,24.4,4.5,1.1000000000000001,0.5,0.9,2.2999999999999998,3.6,5,5.8,8.3000000000000007,7.7,7.3,4.2,1,0.4,5.6,6.7,6.7,7.6,8.1,8.1999999999999993,7.9,8,6.3,6.3,6.1,5.4]
["合肥","暂无数据，用南京数据","32.0ºN，118.8ºE，海拔7m",-7.6,-3.7,4.4000000000000004,13.5,21.4,26.2,27.5,25.9,20.100000000000001,12.3,2,-5.5,29,48,69,87,96,159,188,124,95,60,56,25,7,9,11,12,10,11,13,11,10,8,8,0,0,0,0,0,0,0,0,0,0,0,0,0]
["哈尔滨","暂无数据，用齐齐哈尔数据","47.4ºN，123.9ºE，海拔146m",-19.2,-14.8,-4.5,6.1,14.4,20.3,22.8,20.9,14,4.8,-7.1,-16.2,1.3,1.8,4.7,15.1,30.5,64.2,137.5,94,44.8,19.2,4.2,2.6,0.2,0.5,1.2,2.6,4.3,7.3,11.2,8,6.2,3,1.4,0.7,6.1,7.3,8.1999999999999993,8.3000000000000007,9.1,9.6999999999999993,8.6,8.6999999999999993,8.3000000000000007,7.4,6.3,5.5]
["烟台","暂无数据，用青岛数据","36.1ºN，120.3ºE，海拔76m",-0.9,0.2,4.8,10.4,15.8,19.899999999999999,23.8,25.3,21.5,16.100000000000001,9,2,10.5,12.4,21,36.4,50.9,82.7,177.1,156,90.2,46.5,26.6,9.6999999999999993,1.9,2.1,2.8,4.5999999999999996,4.9000000000000004,6,9.9,8,5.7,4.2,3.2,2.2000000000000002,6,6.4,7.1,7.4,7.9,7.3,5.9,7.2,7.3,7.1,6.3,5.9]
["东沙","暂无数据，用汕头数据","23.4ºN，116.7ºE，海拔1m",13.2,13.8,16.2,20.399999999999999,24.2,26.5,28.2,28,26.5,23.3,19.3,15.1,30,56.1,82.3,155,209.8,302.60000000000002,206.4,214.8,144.69999999999999,61.8,39.1,28.5,4,6.2,7.4,8.5,11.4,14,9.5,10.1,8,3.5,3.5,2.7,4.8,3.6,3.5,3.8,4.5,5.5,8,7.4,6.7,6.8,6,5.7]
["厦门","暂无数据，用汕头数据","23.4ºN，116.7ºE，海拔1m",13.2,13.8,16.2,20.399999999999999,24.2,26.5,28.2,28,26.5,23.3,19.3,15.1,30,56.1,82.3,155,209.8,302.60000000000002,206.4,214.8,144.69999999999999,61.8,39.1,28.5,4,6.2,7.4,8.5,11.4,14,9.5,10.1,8,3.5,3.5,2.7,4.8,3.6,3.5,3.8,4.5,5.5,8,7.4,6.7,6.8,6,5.7]
["长春","暂无数据，用沈阳数据","41.8ºN，123.4ºE，海拔42m",-11.5,-7.8,0.7,9.8000000000000007,17.2,21.7,24.5,23.6,17.3,9.5,0.3,-7.9,6.7,8.1,16.3,42.8,55.1,86.8,166.5,157.4,76.8,42.2,17.100000000000001,8.6,1.8,2,2.9,5.4,6.3,8.1999999999999993,11,9.1999999999999993,6,4.4000000000000004,3,1.7,5.4,6.5,7.5,8,8.6,8.1999999999999993,6.9,7.2,7.8,7,5.5,4.9000000000000004]
["花莲","暂无数据，用台北数据","25.1ºN，121.2ºE，海拔48m",14.4,14.6,16.8,20.8,24.1,26.5,28.4,28.3,26.4,23.3,19.8,16.2,103.3,192.6,211.9,127.9,214.4,200.4,113.2,117.2,151.30000000000001,104.3,96.6,81,7.2,10.6,13.6,14.4,14.3,12.3,8,8.6999999999999993,7.1,5.7,5.3,5.0999999999999996,3.3,2.7,2.6,3.5,4.8,5.7,8.8000000000000007,8.1999999999999993,6.4,5.5,4.8,4.5999999999999996]
["高雄","暂无数据，用台北数据","25.1ºN，121.2ºE，海拔48m",14.4,14.6,16.8,20.8,24.1,26.5,28.4,28.3,26.4,23.3,19.8,16.2,103.3,192.6,211.9,127.9,214.4,200.4,113.2,117.2,151.30000000000001,104.3,96.6,81,7.2,10.6,13.6,14.4,14.3,12.3,8,8.6999999999999993,7.1,5.7,5.3,5.0999999999999996,3.3,2.7,2.6,3.5,4.8,5.7,8.8000000000000007,8.1999999999999993,6.4,5.5,4.8,4.5999999999999996]
["大理","暂无数据，用腾冲数据","25.1ºN，98.5ºE，海拔1655m",7.8,9.5,12.7,15.6,18.100000000000001,19.5,19.5,19.8,19,16.399999999999999,12.1,8.6999999999999993,15.7,30.3,39.799999999999997,75.5,128.5,285.89999999999998,278.7,249.1,159.9,144.19999999999999,48.6,21.8,2.8,4.4000000000000004,6.8,11.1,13,22,24.4,21.7,15.9,11.4,4.7,2.4,7.9,7.5,7.1,6.4,5.6,3.1,2.4,3.6,4.3,5.7,7.1,7.9]
["济南","暂无数据，用天津数据","39.1ºN，117.2ºE，海拔5m",-3.05,-0.75,6.15,14.15,20.55,24.8,26.7,26.05,21.3,14.6,6.05,-0.8,3,6,9,24,34,68,185,155,42,21,10,4,2,3,3,5,6,8,13,11,6,5,4,2,0,0,0,0,0,0,0,0,0,0,0,0]
["延安","暂无数据，用西安数据","34.3ºN，108.9ºE，海拔397m",-0.5,2.2000000000000002,7.9,14.1,19.399999999999999,24.8,26.3,25.3,19.399999999999999,13.8,6.8,0.9,6.4,10.7,26.4,49.5,65.400000000000006,51,92.8,66.7,107.5,65.599999999999994,25.6,5.5,2.1,2.7,4.2,6.5,6.9,5.8,8.1999999999999993,6.6,9.3000000000000007,7.9,4.3,1.4,4.2,4.3,4.9000000000000004,5.5,6.1,7.1,6.7,7.2,4.5,4.3,4,4]
["丽江","暂无数据，用西昌数据","27.9ºN，102.3ºE，海拔1591m",9.4,12,15.9,19,21.1,21.2,22.6,22.1,19.7,16.8,12.8,9.6999999999999993,6.3,4.5,12.3,27.8,95.6,182.5,210.2,177,153.5,78.2,19.600000000000001,6.3,1.2,1.2,2.2999999999999998,5,10.5,16.100000000000001,14.2,12.8,13,9.5,3.6,1.2,7.6,8.1,8.5,8.4,7.3,5,5.9,6.5,4.7,5.4,6.4,6.8]
["石河子","暂无数据，用伊宁数据","44.0ºN，81.3ºE，海拔663m",-9.1999999999999993,-6.9,3.1,12.5,17.2,20.6,22.8,21.8,16.8,9.3000000000000007,1.6,-5.0999999999999996,17.399999999999999,17.7,21.2,27.2,25,27.3,23.8,11.7,15.1,24.2,24.7,19.3,4.7,4.5,5.0999999999999996,4.9000000000000004,5,5,4.9000000000000004,2.7,3.1,4.7,5,4.5999999999999996,5,5.9,6.7,8.1,9.1999999999999993,9.8000000000000007,10.4,10.1,8.9,7.1,5.6,4.5999999999999996]
["贵阳","暂无数据，用芷江(湖南)数据","27.5ºN，109.7ºE，海拔272m",4.8,6.1,10.6,16.399999999999999,21.1,24.5,27.4,27,23.1,17.600000000000001,12.2,7,39,47.1,72.2,164.4,207.9,196,118.7,122.5,66.3,104.2,68,33.799999999999997,7.9,7.9,10.4,13.4,13,11,8.3000000000000007,7.4,6.3,9.1999999999999993,7.8,5.7,1.9,1.7,2.2000000000000002,3.2,4.0999999999999996,5.0999999999999996,8,7.7,5.8,3.9,3.2,2.5]
["桂林","暂无数据，用芷江(湖南)数据","27.5ºN，109.7ºE，海拔272m",4.8,6.1,10.6,16.399999999999999,21.1,24.5,27.4,27,23.1,17.600000000000001,12.2,7,39,47.1,72.2,164.4,207.9,196,118.7,122.5,66.3,104.2,68,33.799999999999997,7.9,7.9,10.4,13.4,13,11,8.3000000000000007,7.4,6.3,9.1999999999999993,7.8,5.7,1.9,1.7,2.2000000000000002,3.2,4.0999999999999996,5.0999999999999996,8,7.7,5.8,3.9,3.2,2.5]
["汕头","真实数据","23.4ºN，116.7ºE，海拔1m",13.2,13.8,16.2,20.399999999999999,24.2,26.5,28.2,28,26.5,23.3,19.3,15.1,30,56.1,82.3,155,209.8,302.60000000000002,206.4,214.8,144.69999999999999,61.8,39.1,28.5,4,6.2,7.4,8.5,11.4,14,9.5,10.1,8,3.5,3.5,2.7,4.8,3.6,3.5,3.8,4.5,5.5,8,7.4,6.7,6.8,6,5.7]
["上海","真实数据","31.2ºN，121.4ºE，海拔3m",3.7,4.5999999999999996,8.5,14.2,19.2,23.4,27.8,27.7,23.6,18.3,12.4,6.1,39,58.8,81.2,102.3,114.5,152,128.19999999999999,133,155.6,60.5,51.2,34.700000000000003,6,7.4,9.4,10,9.6,10.3,8.6999999999999993,7.6,9,5.9,5.0999999999999996,4.7,4.4000000000000004,4.2,4.5,5.0999999999999996,5.6,5.4,7.5,7.8,5.4,5.2,5,4.8]
["南京","真实数据","32.0ºN，118.8ºE，海拔7m",-7.6,-3.7,4.4000000000000004,13.5,21.4,26.2,27.5,25.9,20.100000000000001,12.3,2,-5.5,29,48,69,87,96,159,188,124,95,60,56,25,7,9,11,12,10,11,13,11,10,8,8,0,0,0,0,0,0,0,0,0,0,0,0,0]
{"$rows_left_out":50}